Reaction Details
TargetTyrosine-protein kinase ABL1
LigandBDBM50451309
Substrate/Competitorn/a
Meas. Tech.ChEMBL_1744967 (CHEMBL4179477)
IC50 1370±n/a nM
Citation Romu, AALei, ZZhou, BChen, ZSKorlipara, V Design, synthesis and biological evaluation of WZ4002 analogues as EGFR inhibitors. Bioorg Med Chem Lett27:4832-4837 (2017) 
 
Tyrosine-protein kinase ABL1
Name:Tyrosine-protein kinase ABL1
Type:PROTEIN
Mol. Mass.:122698.35
Organism:Mus musculus
Description:ChEMBL_767349
Residue:1123
BDBM50451309
NameBDBM50451309
Synonyms:CHEMBL4215496
TypeSmall organic molecule
Emp. Form.C31H33ClN6O4
Mol. Mass.589.085
SMILESCOc1cc(ccc1Nc1ncc(Cl)c(Oc2ccccc2NC(=O)COCc2ccccc2)n1)N1CCN(C)CC1