Reaction Details
TargetTyrosine-protein kinase ABL1
LigandBDBM50451300
Substrate/Competitorn/a
Meas. Tech.ChEMBL_1744967 (CHEMBL4179477)
IC50 1900±n/a nM
Citation Romu, AALei, ZZhou, BChen, ZSKorlipara, V Design, synthesis and biological evaluation of WZ4002 analogues as EGFR inhibitors. Bioorg Med Chem Lett27:4832-4837 (2017) 
 
Tyrosine-protein kinase ABL1
Name:Tyrosine-protein kinase ABL1
Type:PROTEIN
Mol. Mass.:122698.35
Organism:Mus musculus
Description:ChEMBL_767349
Residue:1123
BDBM50451300
NameBDBM50451300
Synonyms:CHEMBL4210744
TypeSmall organic molecule
Emp. Form.C22H25ClN6O2
Mol. Mass.440.926
SMILESCOc1cc(ccc1Nc1ncc(Cl)c(Oc2cccc(N)c2)n1)N1CCN(C)CC1