Reaction Details
TargetTyrosine-protein kinase ABL1
LigandBDBM13530
Substrate/Competitorn/a
Meas. Tech.ChEMBL_1744967 (CHEMBL4179477)
IC50 730±n/a nM
Citation Romu, AALei, ZZhou, BChen, ZSKorlipara, V Design, synthesis and biological evaluation of WZ4002 analogues as EGFR inhibitors. Bioorg Med Chem Lett27:4832-4837 (2017) 
 
Tyrosine-protein kinase ABL1
Name:Tyrosine-protein kinase ABL1
Type:PROTEIN
Mol. Mass.:122698.35
Organism:Mus musculus
Description:ChEMBL_767349
Residue:1123
BDBM13530
NameBDBM13530
Synonyms:4-[(4-methylpiperazin-1-yl)methyl]-N-[4-methyl-3-[(4-pyridin-3-ylpyrimidin-2-yl)amino]phenyl]benzamide Gleevec Imatinib, 21 STI-571 US10906896, Cpd imatinib US11725005, Compound imatinib cid_5291 med.21724, Compound 6
TypeSmall organic molecule
Emp. Form.C29H31N7O
Mol. Mass.493.6027
SMILESCN1CCN(Cc2ccc(cc2)C(=O)Nc2ccc(C)c(Nc3nccc(n3)-c3cccnc3)c2)CC1