Reaction Details
TargetTyrosine-protein kinase ABL1
LigandBDBM50451306
Substrate/Competitorn/a
Meas. Tech.ChEMBL_1744968 (CHEMBL4179478)
IC50 4730±n/a nM
Citation Romu, AALei, ZZhou, BChen, ZSKorlipara, V Design, synthesis and biological evaluation of WZ4002 analogues as EGFR inhibitors. Bioorg Med Chem Lett27:4832-4837 (2017) 
 
Tyrosine-protein kinase ABL1
Name:Tyrosine-protein kinase ABL1
Type:PROTEIN
Mol. Mass.:122698.35
Organism:Mus musculus
Description:ChEMBL_767349
Residue:1123
BDBM50451306
NameBDBM50451306
Synonyms:CHEMBL4216265
TypeSmall organic molecule
Emp. Form.C24H27ClN6O3
Mol. Mass.482.963
SMILESCOc1cc(ccc1Nc1ncc(Cl)c(Oc2ccccc2NC(C)=O)n1)N1CCN(C)CC1