Reaction Details
TargetSerine/threonine-protein kinase B-raf
LigandBDBM50452150
Substrate/Competitorn/a
Meas. Tech.ChEMBL_1747145 (CHEMBL4181655)
IC50 0.300000±n/a nM
Citation Smith, ANi, ZJPoon, DHuang, ZChen, ZZhang, QTandeske, LMerritt, HShoemaker, KChan, JKaufman, SHuh, KMurray, JAppleton, BACowan-Jacob, SWScheufler, CKanazawa, TJansen, JMStuart, DShafer, CM Imidazo[1,2-a]pyridin-6-yl-benzamide analogs as potent RAF inhibitors. Bioorg Med Chem Lett27:5221-5224 (2017) 
 
Serine/threonine-protein kinase B-raf
Name:Serine/threonine-protein kinase B-raf
Type:Serine/threonine-protein kinase
Mol. Mass.:84446.00
Organism:Homo sapiens (Human)
Description:P15056
Residue:766
BDBM50452150
NameBDBM50452150
Synonyms:CHEMBL4216386
TypeSmall organic molecule
Emp. Form.C23H19ClN4O2
Mol. Mass.418.876
SMILESCC(=O)Nc1cn2cc(ccc2n1)-c1cc(NC(=O)c2cccc(Cl)c2)ccc1C