Reaction Details
TargetPhosphodiesterase
LigandBDBM50427452
Substrate/Competitorn/a
Meas. Tech.ChEMBL_1749240 (CHEMBL4183750)
Ki 4.0±n/a nM
Citation Blaazer, ARSingh, AKde Heuvel, EEdink, EOrrling, KMVeerman, JJNvan den Bergh, TJansen, CBalasubramaniam, EMooij, WJCusters, HSijm, MTagoe, DNAKalejaiye, TDMunday, JCTenor, HMatheeussen, AWijtmans, MSiderius, Mde Graaf, CMaes, Lde Koning, HPBailey, DSSterk, GJde Esch, IJPBrown, DGLeurs, R Targeting a Subpocket in Trypanosoma brucei Phosphodiesterase B1 (TbrPDEB1) Enables the Structure-Based Discovery of Selective Inhibitors with Trypanocidal Activity. J Med Chem61:3870-3888 (2018) 
 
Phosphodiesterase
Name:Phosphodiesterase
Type:Protein
Mol. Mass.:103683.20
Organism:Trypanosoma brucei
Description:n/a
Residue:930
BDBM50427452
NameBDBM50427452
Synonyms:CHEMBL2326941
TypeSmall organic molecule
Emp. Form.C33H40N6O4
Mol. Mass.584.7085
SMILESCOc1ccc(cc1OCCCCOc1ccc(cc1)-c1nnn[nH]1)C1=NN(C2CCCCCC2)C(=O)[C@@H]2CC=CC[C@H]12