Reaction Details
TargetcAMP-specific 3',5'-cyclic phosphodiesterase 4B
LigandBDBM50453177
Substrate/Competitorn/a
Meas. Tech.ChEMBL_1749241 (CHEMBL4183751)
Ki 2512±n/a nM
Citation Blaazer, ARSingh, AKde Heuvel, EEdink, EOrrling, KMVeerman, JJNvan den Bergh, TJansen, CBalasubramaniam, EMooij, WJCusters, HSijm, MTagoe, DNAKalejaiye, TDMunday, JCTenor, HMatheeussen, AWijtmans, MSiderius, Mde Graaf, CMaes, Lde Koning, HPBailey, DSSterk, GJde Esch, IJPBrown, DGLeurs, R Targeting a Subpocket in Trypanosoma brucei Phosphodiesterase B1 (TbrPDEB1) Enables the Structure-Based Discovery of Selective Inhibitors with Trypanocidal Activity. J Med Chem61:3870-3888 (2018) 
 
cAMP-specific 3',5'-cyclic phosphodiesterase 4B
Name:cAMP-specific 3',5'-cyclic phosphodiesterase 4B
Type:Protein
Mol. Mass.:83318.87
Organism:Homo sapiens (Human)
Description:Q07343
Residue:736
BDBM50453177
NameBDBM50453177
Synonyms:CHEMBL4206114
TypeSmall organic molecule
Emp. Form.C32H38N4O4
Mol. Mass.542.6685
SMILES[H][C@@]12CC=CC[C@]1([H])C(=NN(C1CCCCCC1)C2=O)c1ccc(OC)c(c1)-c1ccc(cc1)C(=O)N(C)CC(N)=O