Reaction Details
TargetPhosphodiesterase
LigandBDBM50453170
Substrate/Competitorn/a
Meas. Tech.ChEMBL_1749240 (CHEMBL4183750)
Ki 316±n/a nM
Citation Blaazer, ARSingh, AKde Heuvel, EEdink, EOrrling, KMVeerman, JJNvan den Bergh, TJansen, CBalasubramaniam, EMooij, WJCusters, HSijm, MTagoe, DNAKalejaiye, TDMunday, JCTenor, HMatheeussen, AWijtmans, MSiderius, Mde Graaf, CMaes, Lde Koning, HPBailey, DSSterk, GJde Esch, IJPBrown, DGLeurs, R Targeting a Subpocket in Trypanosoma brucei Phosphodiesterase B1 (TbrPDEB1) Enables the Structure-Based Discovery of Selective Inhibitors with Trypanocidal Activity. J Med Chem61:3870-3888 (2018) 
 
Phosphodiesterase
Name:Phosphodiesterase
Type:Protein
Mol. Mass.:103683.20
Organism:Trypanosoma brucei
Description:n/a
Residue:930
BDBM50453170
NameBDBM50453170
Synonyms:CHEMBL4214364
TypeSmall organic molecule
Emp. Form.C32H39N3O4
Mol. Mass.529.6698
SMILES[H][C@@]12CC=CC[C@]1([H])C(=NN(C1CCCCCC1)C2=O)c1ccc(OC)c(c1)-c1ccc(cc1)C(=O)NCCOC