Reaction Details
TargetBromodomain-containing protein 3
LigandBDBM179481
Substrate/Competitorn/a
Meas. Tech.ChEMBL_1750677 (CHEMBL4185437)
Kd 0.690000±n/a nM
Citation Zhao, YBai, LLiu, LMcEachern, DStuckey, JAMeagher, JLYang, CYRan, XZhou, BHu, YLi, XWen, BZhao, TLi, SSun, DWang, S Structure-Based Discovery of 4-(6-Methoxy-2-methyl-4-(quinolin-4-yl)-9H-pyrimido[4,5-b]indol-7-yl)-3,5-dimethylisoxazole (CD161) as a Potent and Orally Bioavailable BET Bromodomain Inhibitor. J Med Chem60:3887-3901 (2017) 
 
Bromodomain-containing protein 3
Name:Bromodomain-containing protein 3
Type:Protein
Mol. Mass.:79571.81
Organism:Homo sapiens (Human)
Description:Q15059
Residue:726
BDBM179481
NameBDBM179481
Synonyms:US9675697, Cpd. No. 73
TypeSmall organic molecule
Emp. Form.C26H21N5O2
Mol. Mass.435.4772
SMILESCOc1cc2c(cc1-c1c(C)noc1C)[nH]c1nc(C)nc(-c3ccnc4ccccc34)c21