Reaction Details
TargetProbable maltase-glucoamylase 2
LigandBDBM50241453
Substrate/Competitorn/a
Meas. Tech.ChEMBL_1752597 (CHEMBL4187357)
Ki 1400±n/a nM
Citation Li, ZPSong, YHUddin, ZWang, YPark, KH Inhibition of protein tyrosine phosphatase 1B (PTP1B) and ?-glucosidase by xanthones from Cratoxylum cochinchinense, and their kinetic characterization. Bioorg Med Chem26:737-746 (2018) 
 
Probable maltase-glucoamylase 2
Name:Probable maltase-glucoamylase 2
Type:PROTEIN
Mol. Mass.:277932.17
Organism:Homo sapiens
Description:ChEMBL_116927
Residue:2515
BDBM50241453
NameBDBM50241453
Synonyms:1,3,6,7-tetrahydroxy-2,8-bis(3-methylbut-2-enyl)-9H-xanthen-9-one gamma-mangostin
TypeSmall organic molecule
Emp. Form.C23H24O6
Mol. Mass.396.4331
SMILES[#6]\[#6](-[#6])=[#6]\[#6]-c1c(-[#8])cc2oc3cc(-[#8])c(-[#8])c(-[#6]\[#6]=[#6](\[#6])-[#6])c3c(=O)c2c1-[#8]