Reaction Details
TargetTyrosine-protein phosphatase non-receptor type 1
LigandBDBM50241453
Substrate/Competitorn/a
Meas. Tech.ChEMBL_1752599 (CHEMBL4187359)
Ki 2700±n/a nM
Citation Li, ZPSong, YHUddin, ZWang, YPark, KH Inhibition of protein tyrosine phosphatase 1B (PTP1B) and ?-glucosidase by xanthones from Cratoxylum cochinchinense, and their kinetic characterization. Bioorg Med Chem26:737-746 (2018) 
 
Tyrosine-protein phosphatase non-receptor type 1
Name:Tyrosine-protein phosphatase non-receptor type 1
Type:Protein phosphatase
Mol. Mass.:49963.76
Organism:Homo sapiens (Human)
Description:Human recombinant GST-fusion PTP1B (1-435).
Residue:435
BDBM50241453
NameBDBM50241453
Synonyms:1,3,6,7-tetrahydroxy-2,8-bis(3-methylbut-2-enyl)-9H-xanthen-9-one gamma-mangostin
TypeSmall organic molecule
Emp. Form.C23H24O6
Mol. Mass.396.4331
SMILES[#6]\[#6](-[#6])=[#6]\[#6]-c1c(-[#8])cc2oc3cc(-[#8])c(-[#8])c(-[#6]\[#6]=[#6](\[#6])-[#6])c3c(=O)c2c1-[#8]