Reaction Details
TargetVasopressin V2 receptor
LigandBDBM50020669
Substrate/Competitorn/a
Meas. Tech.ChEBML_31442
Ki 2.5±n/a nM
Citation Ali, FEBryan, WChang, HLHuffman, WFMoore, MLHeckman, GKinter, LBMcDonald, JSchmidt, DShue, D Potent vasopressin antagonists lacking the proline residue at position 7. J Med Chem29:984-8 (1986) Vasopressin V2 receptor
Name:Vasopressin V2 receptor
Type:PROTEIN
Mol. Mass.:40556.17
Organism:Sus scrofa
Description:ChEMBL_214870
Residue:370
BDBM50020669
NameBDBM50020669
Synonyms:13-(2-Amino-ethyl)-19-benzyl-22-(4-ethoxy-benzyl)-16-isopropyl-12,15,18,21,24-pentaoxo-7,8-dithia-11,14,17,20,23-pentaaza-spiro[5.19]pentacosane-10-carboxylic acid (1-carbamoyl-4-guanidino-butyl)-amide | CHEMBL366552
TypeSmall organic molecule
Emp. Form.C46H69N11O8S2
Mol. Mass.968.239
SMILESCCOc1ccc(C[C@@H]2NC(=O)CC3(CCCCC3)SSC[C@@H](NC(=O)[C@@H](CCN)NC(=O)[C@@H](NC(=O)[C@@H](Cc3ccccc3)NC2=O)C(C)C)C(=O)N[C@@H](CCCNC(N)=N)C(N)=O)cc1