Reaction Details
TargetGlucocorticoid receptor
LigandBDBM140009
Substrate/Competitorn/a
Meas. Tech.ChEMBL_1759554 (CHEMBL4194562)
EC50 4.8±n/a nM
Citation Ripa, LEdman, KDearman, MEdenro, GHendrickx, RUllah, VChang, HFLepistö, MChapman, DGeschwindner, SWissler, LSvanberg, PLawitz, KMalmberg, JNikitidis, AOlsson, RIBird, JLlinas, AHegelund-Myrbäck, TBerger, MThorne, PHarrison, RKöhler, CDrmota, T Discovery of a Novel Oral Glucocorticoid Receptor Modulator (AZD9567) with Improved Side Effect Profile. J Med Chem61:1785-1799 (2018) 
 
Glucocorticoid receptor
Name:Glucocorticoid receptor
Type:Enzyme
Mol. Mass.:85656.87
Organism:Homo sapiens (Human)
Description:P04150
Residue:777
BDBM140009
NameBDBM140009
Synonyms:US8901310, Example 1
TypeSmall organic molecule
Emp. Form.C29H29F3N2O2
Mol. Mass.494.548
SMILESCc1ncccc1NC(=O)c1ccc2c(CC[C@@H]3C[C@](O)(CC[C@@]23Cc2ccccc2)C(F)(F)F)c1