Reaction Details
TargetProthrombin
LigandBDBM50147818
Substrate/Competitorn/a
Meas. Tech.ChEMBL_1761087 (CHEMBL4196334)
Ki 0.001400±n/a nM
Citation Xie, ZTian, YLv, XXiao, XZhan, MCheng, KLi, SLiao, C The selectivity and bioavailability improvement of novel oral anticoagulants: An overview. Eur J Med Chem146:299-317 (2018) 
 
Prothrombin
Name:Prothrombin
Type:Protein
Mol. Mass.:70029.57
Organism:Homo sapiens (Human)
Description:P00734
Residue:622
BDBM50147818
NameBDBM50147818
Synonyms:(2-[6-CHLORO-3-{[2,2-DIFLUORO-2-(1-OXIDOPYRIDIN-2-YL)ETHYL]AMINO}-2-OXOPYRAZIN-1(2H)-YL]-N-[5-CHLORO-2-(1H-TETRAZOL-1-YL)BENZYL]ACETAMIDE CHEMBL103461
TypeSmall organic molecule
Emp. Form.C21H17Cl2F2N9O3
Mol. Mass.552.321
SMILES[O-][n+]1ccccc1C(F)(F)CNc1ncc(Cl)n(CC(=O)NCc2cc(Cl)ccc2-n2cnnn2)c1=O