Reaction Details
TargetLymphocyte antigen 96
LigandBDBM43491
Substrate/Competitorn/a
Meas. Tech.ChEMBL_1762123 (CHEMBL4197370)
Kd 71100±n/a nM
Citation Zhang, YLiu, ZWu, JBai, BChen, HXiao, ZChen, LZhao, YLum, HWang, YZhang, HLiang, G New MD2 inhibitors derived from curcumin with improved anti-inflammatory activity. Eur J Med Chem148:291-305 (2018) 
 
Lymphocyte antigen 96
Name:Lymphocyte antigen 96
Type:PROTEIN
Mol. Mass.:18551.39
Organism:Homo sapiens (Human)
Description:ChEMBL_107939
Residue:160
BDBM43491
NameBDBM43491
Synonyms:(3E,5E)-3,5-bis(3,4,5-trimethoxybenzylidene)tetrahydropyran-4-one (3E,5E)-3,5-bis[(3,4,5-trimethoxyphenyl)methylidene]oxan-4-one MLS000860258 cid_5703458
TypeSmall organic molecule
Emp. Form.C25H28O8
Mol. Mass.456.485
SMILESCOc1cc(\C=C2/COC\C(=C/c3cc(OC)c(OC)c(OC)c3)C2=O)cc(OC)c1OC