Reaction Details
TargetPepsin A
LigandBDBM50227343
Substrate/Competitorn/a
Meas. Tech.ChEMBL_154013 (CHEMBL759134)
pH4±n/a
Ki<1±n/a nM
Commentsextracted
Citation Maibaum, JRich, DH Inhibition of porcine pepsin by two substrate analogues containing statine. The effect of histidine at the P2 subsite on the inhibition of aspartic proteinases. J Med Chem31:625-9 (1988) Pepsin A
Name:Pepsin A
Type:Enzyme
Mol. Mass.:41232.87
Organism:Porcine
Description:n/a
Residue:385
BDBM50227343
NameBDBM50227343
Synonyms:CHEMBL3349391
TypeSmall organic molecule
Emp. Form.C37H54N6O8
Mol. Mass.710.8601
SMILESCOC(=O)[C@H](Cc1ccccc1)NC(=O)[C@H](C)NC(=O)C[C@H](O)[C@H](CC(C)C)NC(=O)[C@@H](NC(=O)CNC(=O)[C@@H](N)Cc1ccccc1)C(C)C