Reaction Details
TargetRenin
LigandBDBM50022647
Substrate/Competitorn/a
Meas. Tech.ChEBML_196100
pH6±n/a
IC50 0.290000±n/a nM
Commentsextracted
Citation Plattner, JJMarcotte, PAKleinert, HDStein, HHGreer, JBolis, GFung, AKBopp, BALuly, JRSham, HL Renin inhibitors. Dipeptide analogues of angiotensinogen utilizing a structurally modified phenylalanine residue to impart proteolytic stability. J Med Chem31:2277-88 (1989) Renin
Name:Renin
Type:Enzyme
Mol. Mass.:45058.99
Organism:Homo sapiens (Human)
Description:n/a
Residue:406
BDBM50022647
NameBDBM50022647
Synonyms:2-Benzyl-N-[1-(1-cyclohexylmethyl-2,3-dihydroxy-5-methyl-hexylcarbamoyl)-2-(1H-imidazol-4-yl)-ethyl]-4-morpholin-4-yl-4-oxo-butyramide | CHEMBL306338
TypeSmall organic molecule
Emp. Form.C35H53N5O6
Mol. Mass.639.8252
SMILESCC(C)C[C@H](O)[C@H](O)[C@H](CC1CCCCC1)NC(=O)[C@H](Cc1cnc[nH]1)NC(=O)[C@@H](CC(=O)N1CCOCC1)Cc1ccccc1