Reaction Details
TargetDihydrofolate reductase
LigandBDBM50022740
Substrate/Competitorn/a
Meas. Tech.ChEBML_54599
Ki>1.0±n/a nM
Citation Piper, JRMcCaleb, GSMontgomery, JAKisliuk, RLGaumont, YThorndike, JSirotnak, FM Synthesis and antifolate activity of 5-methyl-5,10-dideaza analogues of aminopterin and folic acid and an alternative synthesis of 5,10-dideazatetrahydrofolic acid, a potent inhibitor of glycinamide ribonucleotide formyltransferase. J Med Chem31:2164-9 (1988) Dihydrofolate reductase
Name:Dihydrofolate reductase
Type:Enzyme
Mol. Mass.:21608.82
Organism:Mus musculus (Mouse)
Description:n/a
Residue:187
BDBM50022740
NameBDBM50022740
Synonyms:2-{4-[2-(2-Amino-5-methyl-4-oxo-3,4-dihydro-pyrido[2,3-d]pyrimidin-6-yl)-ethyl]-benzoylamino}-pentanedioic acid | CHEMBL66864
TypeSmall organic molecule
Emp. Form.C22H23N5O6
Mol. Mass.453.4479
SMILESCc1c(CCc2ccc(cc2)C(=O)NC(CCC(O)=O)C(O)=O)cnc2nc(N)[nH]c(=O)c12