Reaction Details
TargetBifunctional purine biosynthesis protein ATIC
LigandBDBM50022739
Substrate/Competitorn/a
Meas. Tech.ChEBML_28408
IC50 20000±n/a nM
Citation Piper, JRMcCaleb, GSMontgomery, JAKisliuk, RLGaumont, YThorndike, JSirotnak, FM Synthesis and antifolate activity of 5-methyl-5,10-dideaza analogues of aminopterin and folic acid and an alternative synthesis of 5,10-dideazatetrahydrofolic acid, a potent inhibitor of glycinamide ribonucleotide formyltransferase. J Med Chem31:2164-9 (1988) Bifunctional purine biosynthesis protein ATIC
Name:Bifunctional purine biosynthesis protein ATIC
Type:Protein
Mol. Mass.:64616.62
Organism:Homo sapiens (Human)
Description:P31939
Residue:592
BDBM50022739
NameBDBM50022739
Synonyms:(6RS) 2-{4-[2-(2-Amino-5-ethyl-4-oxo-3,4,5,6,7,8-hexahydro-pyrido[2,3-d]pyrimidin-6-yl)-ethyl]-benzoylamino}-pentanedioic acid | CHEMBL267890
TypeSmall organic molecule
Emp. Form.C23H29N5O6
Mol. Mass.471.5063
SMILESCCC1C(CCc2ccc(cc2)C(=O)NC(CCC(O)=O)C(O)=O)CNc2nc(N)[nH]c(=O)c12