Reaction Details
TargetCarbonic anhydrase 9
LigandBDBM50366034
Substrate/Competitorn/a
Meas. Tech.ChEMBL_1767076 (CHEMBL4202323)
Ki 82±n/a nM
Citation Angeli, ATrallori, ECarta, FDi Cesare Mannelli, LGhelardini, CSupuran, CT Heterocoumarins Are Selective Carbonic Anhydrase IX and XII Inhibitors with Cytotoxic Effects against Cancer Cells Lines. ACS Med Chem Lett9:947-951 (2018) 
 
Carbonic anhydrase 9
Name:Carbonic anhydrase 9
Type:Enzyme
Mol. Mass.:49669.03
Organism:Homo sapiens (Human)
Description:Catalytic domain of human cloned isozyme was used in the assay
Residue:459
BDBM50366034
NameBDBM50366034
Synonyms:CHEMBL186422
TypeSmall organic molecule
Emp. Form.C9H7NO
Mol. Mass.145.158
SMILESO=c1ccc2ccccc2[nH]1