Reaction Details
TargetCarbonic anhydrase 12
LigandBDBM50366034
Substrate/Competitorn/a
Meas. Tech.ChEMBL_1767077 (CHEMBL4202324)
Ki 93±n/a nM
Citation Angeli, ATrallori, ECarta, FDi Cesare Mannelli, LGhelardini, CSupuran, CT Heterocoumarins Are Selective Carbonic Anhydrase IX and XII Inhibitors with Cytotoxic Effects against Cancer Cells Lines. ACS Med Chem Lett9:947-951 (2018) 
 
Carbonic anhydrase 12
Name:Carbonic anhydrase 12
Type:Enzyme
Mol. Mass.:39456.00
Organism:Homo sapiens (Human)
Description:Catalytic domain of human cloned isozyme was used in the assay
Residue:354
BDBM50366034
NameBDBM50366034
Synonyms:CHEMBL186422
TypeSmall organic molecule
Emp. Form.C9H7NO
Mol. Mass.145.158
SMILESO=c1ccc2ccccc2[nH]1