Reaction Details
TargetPlatelet-derived growth factor receptor beta
LigandBDBM21079
Substrate/Competitorn/a
Meas. Tech.ChEMBL_1768145 (CHEMBL4220257)
IC50 66±n/a nM
Citation Philip, SKumarasiri, MTeo, TYu, MWang, S Cyclin-Dependent Kinase 8: A New Hope in Targeted Cancer Therapy? J Med Chem61:5073-5092 (2018) 
 
Platelet-derived growth factor receptor beta
Name:Platelet-derived growth factor receptor beta
Type:Enzyme
Mol. Mass.:123922.25
Organism:Homo sapiens (Human)
Description:P09619
Residue:1106
BDBM21079
NameBDBM21079
Synonyms:1-[4-(3-amino-1H-indazol-4-yl)phenyl]-3-(2-fluoro-5-methyl-phenyl)urea 1-[4-(3-azanyl-1H-indazol-4-yl)phenyl]-3-(2-fluoranyl-5-methyl-phenyl)urea ABT-869 CHEMBL223360 | cid_11485656
TypeSmall organic molecule
Emp. Form.C21H18FN5O
Mol. Mass.375.3989
SMILESCc1ccc(F)c(NC(=O)Nc2ccc(cc2)-c2cccc3[nH]nc(N)c23)c1