Reaction Details
TargetHistone deacetylase 1/REST corepressor 3
LigandBDBM19149
Substrate/Competitorn/a
Meas. Tech.ChEMBL_1769411 (CHEMBL4221523)
Ki 3.0±n/a nM
Citation Milelli, AMarchetti, CTurrini, ECatanzaro, EMazzone, RTomaselli, DFimognari, CTumiatti, VMinarini, A Novel polyamine-based Histone deacetylases-Lysine demethylase 1 dual binding inhibitors. Bioorg Med Chem Lett28:1001-1004 (2018) 
 
Histone deacetylase 1/REST corepressor 3
Name:Histone deacetylase 1/REST corepressor 3
Synonyms:HDAC1/REST corepressor 3
Type:n/a
Mol. Mass.:n/a
Description:ASSAY_ID of ChEMBL is 1769411
Components:This complex has 2 components.
Component 1
Name:Histone deacetylase 1
Type:Enzyme
Mol. Mass.:55090.27
Organism:Homo sapiens (Human)
Description:Q13547
Residue:482
Component 2
Name:REST corepressor 3
Synonyms:KIAA1343 RCOR3_HUMAN | REST corepressor 3
Type:PROTEIN
Mol. Mass.:55589.31
Organism:Homo sapiens
Description:ChEMBL_118345
Residue:495
BDBM19149
NameBDBM19149
Synonyms:CHEMBL98 SAHA US10188756, Compound SAHA US11505523, Compound SAHA US9353061, SAHA US9695181, Vorinostat Zolinza suberoylanilide hydroxamic acid
TypeSmall organic molecule
Emp. Form.C14H20N2O3
Mol. Mass.264.3202
SMILESONC(=O)CCCCCCC(=O)Nc1ccccc1