Reaction Details
TargetProstaglandin D2 receptor
LigandBDBM50460673
Substrate/Competitorn/a
Meas. Tech.ChEMBL_1770029 (CHEMBL4222141)
Ki 674±n/a nM
Citation Stachel, SJEgbertson, MSWai, JMachacek, MToolan, DMSwestock, JEddins, DMPuri, VMcGaughey, GSu, HPPerlow, DWang, DMa, LParthasarathy, GReid, JCAbeywickrema, PDSmith, SMUslaner, JM Indole acids as a novel PDE2 inhibitor chemotype that demonstrate pro-cognitive activity in multiple species. Bioorg Med Chem Lett28:1122-1126 (2018) 
 
Prostaglandin D2 receptor
Name:Prostaglandin D2 receptor
Type:Enzyme
Mol. Mass.:40288.87
Organism:Homo sapiens (Human)
Description:Q13258
Residue:359
BDBM50460673
NameBDBM50460673
Synonyms:CHEMBL4229054
TypeSmall organic molecule
Emp. Form.C24H23F4NO4S
Mol. Mass.497.502
SMILESC[C@H](c1ccc(cc1)C(F)(F)F)n1c2[C@H](CC(O)=O)CCCc2c2cc(F)cc(c12)S(C)(=O)=O