Reaction Details
TargetDopamine beta-hydroxylase
LigandBDBM50023371
Substrate/Competitorn/a
Meas. Tech.ChEMBL_50738 (CHEMBL660770)
Ki 1200000±n/a nM
Citation Kruse, LIKaiser, CDeWolf, WEChambers, PAGoodhart, PJEzekiel, MOhlstein, EH Beta-substituted phenethylamines as high-affinity mechanism-based inhibitors of dopamine beta-hydroxylase. J Med Chem31:704-6 (1988) Dopamine beta-hydroxylase
Name:Dopamine beta-hydroxylase
Type:PROTEIN
Mol. Mass.:68136.39
Organism:Bos taurus
Description:ChEMBL_50738
Residue:610
BDBM50023371
NameBDBM50023371
Synonyms:4-Cyclopropylmethyl-phenol | CHEMBL162030
TypeSmall organic molecule
Emp. Form.C10H12O
Mol. Mass.148.2017
SMILESOc1ccc(CC2CC2)cc1