Reaction Details
TargetG protein-coupled receptor kinase 5
LigandBDBM284005
Substrate/Competitorn/a
Meas. Tech.ChEMBL_1771207 (CHEMBL4223319)
IC50 12000±n/a nM
Citation Waldschmidt, HVBouley, RKirchhoff, PDLee, PTesmer, JJGLarsen, SD Utilizing a structure-based docking approach to develop potent G protein-coupled receptor kinase (GRK) 2 and 5 inhibitors. Bioorg Med Chem Lett28:1507-1515 (2018) 
 
G protein-coupled receptor kinase 5
Name:G protein-coupled receptor kinase 5
Type:PROTEIN
Mol. Mass.:67798.93
Organism:Homo sapiens (Human)
Description:ChEMBL_1280627
Residue:590
BDBM284005
NameBDBM284005
Synonyms:E31 | US10023564, Example 31
TypeSmall organic molecule
Emp. Form.C27H29FN6O5
Mol. Mass.536.5548
SMILESCC1=C(C(NC(=O)N1)c1ccc(F)c(CC(=O)N2CCOC(CCO)C2)c1)C(=O)Nc1ccc2[nH]ncc2c1