Reaction Details
TargetDihydrofolate reductase
LigandBDBM50023682
Substrate/Competitorn/a
Meas. Tech.ChEBML_217876
Ki>0.004±n/a nM
Citation Su, TLHuang, JTChou, TCOtter, GMSirotnak, FMWatanabe, KA Chemical synthesis and biological activities of 5-deazaaminopterin analogues bearing substituent(s) at the 5- and/or 7-position(s). J Med Chem31:1209-15 (1988) Dihydrofolate reductase
Name:Dihydrofolate reductase
Type:Enzyme
Mol. Mass.:21608.82
Organism:Mus musculus (Mouse)
Description:n/a
Residue:187
BDBM50023682
NameBDBM50023682
Synonyms:2-{4-[(2,4-Diamino-5-methyl-7-phenyl-pyrido[2,3-d]pyrimidin-6-ylmethyl)-amino]-benzoylamino}-pentanedioic acid | CHEMBL20423
TypeSmall organic molecule
Emp. Form.C27H27N7O5
Mol. Mass.529.5472
SMILESCc1c(CNc2ccc(cc2)C(=O)NC(CCC(O)=O)C(O)=O)c(nc2nc(N)nc(N)c12)-c1ccccc1