Reaction Details
TargetSerine palmitoyltransferase 2
LigandBDBM50461646
Substrate/Competitorn/a
Meas. Tech.ChEMBL_1771688 (CHEMBL4223800)
IC50 0.130000±n/a nM
Citation Kojima, TAsano, YKurasawa, OHirata, YIwamura, NWong, TTSaito, BTanaka, YArai, RYonemori, KMiyamoto, YSagiya, YYaguchi, MShibata, SMizutani, ASano, OAdachi, RSatomi, YHirayama, MAoyama, KHiura, YKiba, AKitamura, SImamura, S Discovery of novel serine palmitoyltransferase inhibitors as cancer therapeutic agents. Bioorg Med Chem26:2452-2465 (2018) 
 
Serine palmitoyltransferase 2
Name:Serine palmitoyltransferase 2
Type:PROTEIN
Mol. Mass.:62932.15
Organism:Homo sapiens (Human)
Description:ChEMBL_660504
Residue:562
BDBM50461646
NameBDBM50461646
Synonyms:CHEBI:582124 | Myriocin
TypeSmall organic molecule
Emp. Form.C21H39NO6
Mol. Mass.401.5375
SMILESCCCCCCC(=O)CCCCCC\C=C\C[C@@H](O)[C@H](O)[C@@](N)(CO)C(O)=O