Reaction Details
TargetPhosphatidylinositol 4,5-bisphosphate 3-kinase catalytic subunit alpha isoform
LigandBDBM50403068
Substrate/Competitorn/a
Meas. Tech.ChEMBL_1774686 (CHEMBL4231678)
IC50 737±n/a nM
Citation Ma, CCZhang, CMTang, LQLiu, ZP Discovery of novel quinazolinone derivatives as high potent and selective PI3K? and PI3K?/? inhibitors. Eur J Med Chem151:9-17 (2018) 
 
Phosphatidylinositol 4,5-bisphosphate 3-kinase catalytic subunit alpha isoform
Name:Phosphatidylinositol 4,5-bisphosphate 3-kinase catalytic subunit alpha isoform
Type:Enzyme Subunit
Mol. Mass.:124294.87
Organism:Homo sapiens (Human)
Description:P42336
Residue:1068
BDBM50403068
NameBDBM50403068
Synonyms:CHEMBL2216870 US9745321, CAL-101
TypeSmall organic molecule
Emp. Form.C22H18FN7O
Mol. Mass.415.423
SMILESCC[C@H](Nc1ncnc2nc[nH]c12)c1nc2cccc(F)c2c(=O)n1-c1ccccc1