Reaction Details
TargetSerine/threonine-protein kinase MARK1
LigandBDBM50462709
Substrate/Competitorn/a
Meas. Tech.ChEMBL_1776360 (CHEMBL4233352)
IC50>1000±n/a nM
Citation Gao, HMarhefka, CJacobs, MDCao, JBandarage, UKGreen, J ROCK inhibitors 2. Improving potency, selectivity and solubility through the application of rationally designed solubilizing groups. Bioorg Med Chem Lett28:2616-2621 (2018) 
 
Serine/threonine-protein kinase MARK1
Name:Serine/threonine-protein kinase MARK1
Type:Enzyme
Mol. Mass.:89034.85
Organism:Homo sapiens (Human)
Description:Q9P0L2
Residue:795
BDBM50462709
NameBDBM50462709
Synonyms:CHEMBL4245507
TypeSmall organic molecule
Emp. Form.C23H27N5O2S
Mol. Mass.437.558
SMILESO=C(Cc1cccc(OCCCN2CCNCC2)c1)Nc1nc(cs1)-c1ccncc1