Reaction Details
TargetMisshapen-like kinase 1
LigandBDBM50462709
Substrate/Competitorn/a
Meas. Tech.ChEMBL_1776363 (CHEMBL4233355)
IC50>1000±n/a nM
Citation Gao, HMarhefka, CJacobs, MDCao, JBandarage, UKGreen, J ROCK inhibitors 2. Improving potency, selectivity and solubility through the application of rationally designed solubilizing groups. Bioorg Med Chem Lett28:2616-2621 (2018) 
 
Misshapen-like kinase 1
Name:Misshapen-like kinase 1
Type:PROTEIN
Mol. Mass.:149838.92
Organism:Homo sapiens (Human)
Description:ChEMBL_793919
Residue:1332
BDBM50462709
NameBDBM50462709
Synonyms:CHEMBL4245507
TypeSmall organic molecule
Emp. Form.C23H27N5O2S
Mol. Mass.437.558
SMILESO=C(Cc1cccc(OCCCN2CCNCC2)c1)Nc1nc(cs1)-c1ccncc1