Reaction Details
TargetMetabotropic glutamate receptor 4
LigandBDBM50293743
Substrate/Competitorn/a
Meas. Tech.ChEMBL_1776478 (CHEMBL4233470)
EC50 1100±n/a nM
Citation Engers, DWBollinger, SREngers, JLPanarese, JDBreiner, MMGregro, ABlobaum, ALBronson, JJWu, YJMacor, JERodriguez, ALZamorano, RConn, PJLindsley, CWNiswender, CMHopkins, CR Discovery and characterization of N-(1,3-dialkyl-1H-indazol-6-yl)-1H-pyrazolo[4,3-b]pyridin-3-amine scaffold as mGlu Bioorg Med Chem Lett28:2641-2646 (2018) 
 
Metabotropic glutamate receptor 4
Name:Metabotropic glutamate receptor 4
Type:Protein
Mol. Mass.:101899.95
Organism:Homo sapiens (Human)
Description:Q14833
Residue:912
BDBM50293743
NameBDBM50293743
Synonyms:CHEMBL556667 cid_836002
TypeSmall organic molecule
Emp. Form.C12H9ClN2O
Mol. Mass.232.666
SMILESClc1cccc(NC(=O)c2ccccn2)c1