Reaction Details
TargetTyrosine-protein kinase BTK
LigandBDBM164875
Substrate/Competitorn/a
Meas. Tech.ChEMBL_1778705 (CHEMBL4235697)
IC50 26±n/a nM
Citation Liu, QBatt, DGChaudhry, CLippy, JSPattoli, MASurti, NXu, SCarter, PHBurke, JRTino, JA Conversion of carbazole carboxamide based reversible inhibitors of Bruton's tyrosine kinase (BTK) into potent, selective irreversible inhibitors in the carbazole, tetrahydrocarbazole, and a new 2,3-dimethylindole series. Bioorg Med Chem Lett28:3080-3084 (2018) 
 
Tyrosine-protein kinase BTK
Name:Tyrosine-protein kinase BTK
Type:Enzyme
Mol. Mass.:76289.95
Organism:Homo sapiens (Human)
Description:Q06187
Residue:659
BDBM164875
NameBDBM164875
Synonyms:US10604504, Example 23 US9688629, 23 US9920031, Example 23
TypeSmall organic molecule
Emp. Form.C21H23N3O3S
Mol. Mass.397.491
SMILESCN(c1cccc(c1C)-c1ccc(C(N)=O)c2[nH]c(C)c(C)c12)S(=O)(=O)C=C