Reaction Details
TargetTyrosine-protein kinase BTK
LigandBDBM164805
Substrate/Competitorn/a
Meas. Tech.ChEMBL_1778704 (CHEMBL4235696)
IC50 0.077000±n/a nM
Citation Liu, QBatt, DGChaudhry, CLippy, JSPattoli, MASurti, NXu, SCarter, PHBurke, JRTino, JA Conversion of carbazole carboxamide based reversible inhibitors of Bruton's tyrosine kinase (BTK) into potent, selective irreversible inhibitors in the carbazole, tetrahydrocarbazole, and a new 2,3-dimethylindole series. Bioorg Med Chem Lett28:3080-3084 (2018) 
 
Tyrosine-protein kinase BTK
Name:Tyrosine-protein kinase BTK
Type:Enzyme
Mol. Mass.:76289.95
Organism:Homo sapiens (Human)
Description:Q06187
Residue:659
BDBM164805
NameBDBM164805
Synonyms:US10604504, Example 4 US9688629, 4 US9920031, Example 4
TypeSmall organic molecule
Emp. Form.C19H19N3O3S
Mol. Mass.369.437
SMILESCc1[nH]c2c(ccc(-c3cccc(NS(=O)(=O)C=C)c3)c2c1C)C(N)=O