Reaction Details
TargetDihydrofolate reductase
LigandBDBM50024474
Substrate/Competitorn/a
Meas. Tech.ChEBML_54896
IC50 16000±n/a nM
Citation Nair, MGDhawan, RGhazala, MKalman, TIFerone, RGaumont, YKisliuk, RL Folate analogues. 30. Synthesis and biological evaluation of N10-propargyl-5,8-dideaza-5,6,7,8-tetrahydrofolic acid and related compounds. J Med Chem30:1256-61 (1987) Dihydrofolate reductase
Name:Dihydrofolate reductase
Type:PROTEIN
Mol. Mass.:18437.08
Organism:Lactobacillus casei
Description:ChEMBL_1357878
Residue:163
BDBM50024474
NameBDBM50024474
Synonyms:2-{4-[(2-Amino-4-oxo-3,4,5,6,7,8-hexahydro-quinazolin-6-ylmethyl)-methyl-amino]-benzoylamino}-pentanedioic acid | CHEMBL22708
TypeSmall organic molecule
Emp. Form.C22H27N5O6
Mol. Mass.457.4797
SMILESCN(CC1CCc2nc(N)[nH]c(=O)c2C1)c1ccc(cc1)C(=O)NC(CCC(O)=O)C(O)=O