Reaction Details
TargetPotassium voltage-gated channel subfamily H member 2
LigandBDBM50357312
Substrate/Competitorn/a
Meas. Tech.ChEMBL_1779271 (CHEMBL4236263)
Ki 1100±n/a nM
Citation Qiu, HLiu-Bujalski, LCaldwell, RDFollis, AVGardberg, AGoutopoulos, AGrenningloh, RHead, JJohnson, TJones, RMochalkin, IMorandi, FNeagu, CSherer, B Discovery of potent, highly selective covalent irreversible BTK inhibitors from a fragment hit. Bioorg Med Chem Lett28:2939-2944 (2018) 
 
Potassium voltage-gated channel subfamily H member 2
Name:Potassium voltage-gated channel subfamily H member 2
Type:Multi-pass membrane protein
Mol. Mass.:126672.65
Organism:Homo sapiens (Human)
Description:Q12809
Residue:1159
BDBM50357312
NameBDBM50357312
Synonyms:IBRUTINIB US10124003, Ref. Ex. Compound 1 US10793575, Example ibrutinib US10919899, Ibrutinib US11186578, Example Ibrutinib US11407754, Example Ibrutinib US20240059694, Compound Ibrutinib US9181263, 1 | US9278100, 1
TypeSmall organic molecule
Emp. Form.C25H24N6O2
Mol. Mass.440.4971
SMILESNc1ncnc2n(nc(-c3ccc(Oc4ccccc4)cc3)c12)[C@@H]1CCCN(C1)C(=O)C=C