Reaction Details
TargetHistone deacetylase 1
LigandBDBM50463736
Substrate/Competitorn/a
Meas. Tech.ChEMBL_1779290 (CHEMBL4236282)
Ki 0.097000±n/a nM
Citation Fournier, JFBhurruth-Alcor, YMusicki, BAubert, JAurelly, MBouix-Peter, CBouquet, KChantalat, LDelorme, MDrean, BDuvert, GFleury-Bregeot, NGauthier, BGrisendi, KHarris, CSHennequin, LFIsabet, TJoly, FLafitte, GMillois, CMorgentin, RPascau, JPiwnica, DRival, YSoulet, CThoreau, ÉTomas, L Squaramides as novel class I and IIB histone deacetylase inhibitors for topical treatment of cutaneous t-cell lymphoma. Bioorg Med Chem Lett28:2985-2992 (2018) 
 
Histone deacetylase 1
Name:Histone deacetylase 1
Type:Enzyme
Mol. Mass.:55090.27
Organism:Homo sapiens (Human)
Description:Q13547
Residue:482
BDBM50463736
NameBDBM50463736
Synonyms:CHEMBL4251203
TypeSmall organic molecule
Emp. Form.C18H23N3O4
Mol. Mass.345.3929
SMILESCC(CCCCC(=O)NO)Nc1c(Nc2ccc(C)cc2)c(=O)c1=O