Reaction Details
TargetHistone deacetylase 1
LigandBDBM50463749
Substrate/Competitorn/a
Meas. Tech.ChEMBL_1779290 (CHEMBL4236282)
Ki 0.910000±n/a nM
Citation Fournier, JFBhurruth-Alcor, YMusicki, BAubert, JAurelly, MBouix-Peter, CBouquet, KChantalat, LDelorme, MDrean, BDuvert, GFleury-Bregeot, NGauthier, BGrisendi, KHarris, CSHennequin, LFIsabet, TJoly, FLafitte, GMillois, CMorgentin, RPascau, JPiwnica, DRival, YSoulet, CThoreau, ÉTomas, L Squaramides as novel class I and IIB histone deacetylase inhibitors for topical treatment of cutaneous t-cell lymphoma. Bioorg Med Chem Lett28:2985-2992 (2018) 
 
Histone deacetylase 1
Name:Histone deacetylase 1
Type:Enzyme
Mol. Mass.:55090.27
Organism:Homo sapiens (Human)
Description:Q13547
Residue:482
BDBM50463749
NameBDBM50463749
Synonyms:CHEMBL4242426
TypeSmall organic molecule
Emp. Form.C18H24N4O4
Mol. Mass.360.4076
SMILESCN(C)c1ccc(Nc2c(NCCCCCC(=O)NO)c(=O)c2=O)cc1