Reaction Details
TargetHistone deacetylase 3
LigandBDBM50105327
Substrate/Competitorn/a
Meas. Tech.ChEMBL_1779294 (CHEMBL4236286)
Ki 4.3±n/a nM
Citation Fournier, JFBhurruth-Alcor, YMusicki, BAubert, JAurelly, MBouix-Peter, CBouquet, KChantalat, LDelorme, MDrean, BDuvert, GFleury-Bregeot, NGauthier, BGrisendi, KHarris, CSHennequin, LFIsabet, TJoly, FLafitte, GMillois, CMorgentin, RPascau, JPiwnica, DRival, YSoulet, CThoreau, ÉTomas, L Squaramides as novel class I and IIB histone deacetylase inhibitors for topical treatment of cutaneous t-cell lymphoma. Bioorg Med Chem Lett28:2985-2992 (2018) 
 
Histone deacetylase 3
Name:Histone deacetylase 3
Type:Enzyme
Mol. Mass.:48829.55
Organism:Homo sapiens (Human)
Description:O15379
Residue:428
BDBM50105327
NameBDBM50105327
Synonyms:JNJ-26481585 | Quisinostat
TypeSmall organic molecule
Emp. Form.C21H26N6O2
Mol. Mass.394.4701
SMILESCn1cc(CNCC2CCN(CC2)c2ncc(cn2)C(=O)NO)c2ccccc12