Reaction Details
TargetHistone deacetylase 3
LigandBDBM50463738
Substrate/Competitorn/a
Meas. Tech.ChEMBL_1779294 (CHEMBL4236286)
Ki 58±n/a nM
Citation Fournier, JFBhurruth-Alcor, YMusicki, BAubert, JAurelly, MBouix-Peter, CBouquet, KChantalat, LDelorme, MDrean, BDuvert, GFleury-Bregeot, NGauthier, BGrisendi, KHarris, CSHennequin, LFIsabet, TJoly, FLafitte, GMillois, CMorgentin, RPascau, JPiwnica, DRival, YSoulet, CThoreau, ÉTomas, L Squaramides as novel class I and IIB histone deacetylase inhibitors for topical treatment of cutaneous t-cell lymphoma. Bioorg Med Chem Lett28:2985-2992 (2018) 
 
Histone deacetylase 3
Name:Histone deacetylase 3
Type:Enzyme
Mol. Mass.:48829.55
Organism:Homo sapiens (Human)
Description:O15379
Residue:428
BDBM50463738
NameBDBM50463738
Synonyms:CHEMBL4244764
TypeSmall organic molecule
Emp. Form.C22H33N3O4
Mol. Mass.403.5151
SMILESCC(Nc1c(NCCCCCC(=O)NO)c(=O)c1=O)C12CC3CC(CC(C3)C1)C2