Reaction Details
TargetProstaglandin G/H synthase 1/2
LigandBDBM50012434
Substrate/Competitorn/a
Meas. Tech.ChEMBL_157976 (CHEMBL856202)
IC50 5300±n/a nM
Citation Musser, JHKubrak, DMBender, RHKreft, AFNielsen, STLefer, AMChang, JLewis, AJHand, JM Phenylephrine derivatives as leukotriene D4 antagonists. J Med Chem30:2087-93 (1987) Prostaglandin G/H synthase 1/2
Name:Prostaglandin G/H synthase 1/2
Synonyms:Cyclooxygenase
Type:n/a
Mol. Mass.:n/a
Description:ASSAY_ID of ChEMBL is 1981650
Components:This complex has 2 components.
Component 1
Name:Prostaglandin G/H synthase 2
Type:Enzyme
Mol. Mass.:69003.89
Organism:Homo sapiens (Human)
Description:Recombinant Cox-2 provided by Cayman (Cayman Chemical Co.,Ann Arbor, MI).
Residue:604
Component 2
Name:Prostaglandin G/H synthase 1
Synonyms:COX-1 Cyclooxygenase Cyclooxygenase-1 (COX-1) PTGS1 | Prostaglandin G/H synthase (cyclooxygenase)
Type:Enzyme
Mol. Mass.:68692.62
Organism:Homo sapiens (Human)
Description:P23219
Residue:599
BDBM50012434
NameBDBM50012434
Synonyms:(REV-5,901)1-[3-(Quinolin-2-ylmethoxy)-phenyl]-hexan-1-ol 1-[3-(Quinolin-2-ylmethoxy)-phenyl]-hexan-1-ol (RG 5901) CHEMBL8747 REV-901
TypeSmall organic molecule
Emp. Form.C22H25NO2
Mol. Mass.335.4394
SMILESCCCCCC(O)c1cccc(OCc2ccc3ccccc3n2)c1