Reaction Details
TargetAromatase
LigandBDBM50025154
Substrate/Competitorn/a
Meas. Tech.ChEMBL_50690 (CHEMBL663077)
IC50 10200±n/a nM
Citation Daly, MJJones, GWNicholls, PJSmith, HJRowlands, MGBunnett, MA Synthesis and biochemical evaluation of analogues of aminoglutethimide based on phenylpyrrolidine-2,5-dione. J Med Chem29:520-3 (1986) Aromatase
Name:Aromatase
Type:Enzyme
Mol. Mass.:57888.92
Organism:Homo sapiens (Human)
Description:P11511
Residue:503
BDBM50025154
NameBDBM50025154
Synonyms:3-(4-Amino-phenyl)-pyrrolidine-2,5-dione | CHEMBL148903
TypeSmall organic molecule
Emp. Form.C10H10N2O2
Mol. Mass.190.1986
SMILESNc1ccc(cc1)C1CC(=O)NC1=O