Reaction Details
TargetAromatase
LigandBDBM50025151
Substrate/Competitorn/a
Meas. Tech.ChEMBL_50690 (CHEMBL663077)
IC50 10040±n/a nM
Citation Daly, MJJones, GWNicholls, PJSmith, HJRowlands, MGBunnett, MA Synthesis and biochemical evaluation of analogues of aminoglutethimide based on phenylpyrrolidine-2,5-dione. J Med Chem29:520-3 (1986) Aromatase
Name:Aromatase
Type:Enzyme
Mol. Mass.:57888.92
Organism:Homo sapiens (Human)
Description:P11511
Residue:503
BDBM50025151
NameBDBM50025151
Synonyms:3-(4-Amino-phenyl)-1-methyl-pyrrolidine-2,5-dione | CHEMBL357775
TypeSmall organic molecule
Emp. Form.C11H12N2O2
Mol. Mass.204.2252
SMILESCN1C(=O)CC(C1=O)c1ccc(N)cc1