Reaction Details
TargetAromatase
LigandBDBM50025152
Substrate/Competitorn/a
Meas. Tech.ChEMBL_50691 (CHEMBL663078)
IC50 13500±n/a nM
Citation Daly, MJJones, GWNicholls, PJSmith, HJRowlands, MGBunnett, MA Synthesis and biochemical evaluation of analogues of aminoglutethimide based on phenylpyrrolidine-2,5-dione. J Med Chem29:520-3 (1986) Aromatase
Name:Aromatase
Type:Enzyme
Mol. Mass.:57888.92
Organism:Homo sapiens (Human)
Description:P11511
Residue:503
BDBM50025152
NameBDBM50025152
Synonyms:3-(4-Amino-phenyl)-3-ethyl-pyrrolidine-2,5-dione | CHEMBL151212
TypeSmall organic molecule
Emp. Form.C12H14N2O2
Mol. Mass.218.2518
SMILESCCC1(CC(=O)NC1=O)c1ccc(N)cc1