Reaction Details
TargetSialidase-3
LigandBDBM50331694
Substrate/Competitorn/a
Meas. Tech.ChEMBL_1789502 (CHEMBL4261236)
IC50 34000±n/a nM
Citation Guo, THéon-Roberts, RZou, CZheng, RPshezhetsky, AVCairo, CW Selective Inhibitors of Human Neuraminidase 1 (NEU1). J Med Chem61:11261-11279 (2018) 
 
Sialidase-3
Name:Sialidase-3
Type:PROTEIN
Mol. Mass.:48257.99
Organism:Homo sapiens (Human)
Description:ChEMBL_461856
Residue:428
BDBM50331694
NameBDBM50331694
Synonyms:(2R,3R,4S)-3-acetamido-2-((1R,2R)-3-benzamido-1,2-dihydroxypropyl)-4-hydroxy-3,4-dihydro-2H-pyran-6-carboxylate | CHEMBL1289198
TypeSmall organic molecule
Emp. Form.C18H22N2O8
Mol. Mass.394.3759
SMILESCC(=O)N[C@@H]1[C@@H](O)C=C(O[C@H]1[C@H](O)[C@H](O)CNC(=O)c1ccccc1)C(O)=O