Reaction Details
TargetPolyunsaturated fatty acid 5-lipoxygenase
LigandBDBM50025321
Substrate/Competitorn/a
Meas. Tech.ChEBML_3907
IC50 95±n/a nM
Citation Horie, TTsukayama, MKourai, HYokoyama, CFurukawa, MYoshimoto, TYamamoto, SWatanabe-Kohno, SOhata, K Syntheses of 5,6,7- and 5,7,8-trioxygenated 3',4'-dihydroxyflavones having alkoxy groups and their inhibitory activities against arachidonate 5-lipoxygenase. J Med Chem29:2256-62 (1986) Polyunsaturated fatty acid 5-lipoxygenase
Name:Polyunsaturated fatty acid 5-lipoxygenase
Type:PROTEIN
Mol. Mass.:78082.31
Organism:Rattus norvegicus
Description:ChEMBL_1432947
Residue:673
BDBM50025321
NameBDBM50025321
Synonyms:2-(3,4-Dihydroxy-phenyl)-5-hydroxy-6,7-dimethoxy-chromen-4-one 5,3',4'-Trihydroxy-6,7-dimethoxyflavone Cirsiliol
TypeSmall organic molecule
Emp. Form.C17H14O7
Mol. Mass.330.2889
SMILESCOc1cc2oc(cc(=O)c2c(O)c1OC)-c1ccc(O)c(O)c1