Reaction Details
TargetBromodomain-containing protein 3
LigandBDBM50466254
Substrate/Competitorn/a
Meas. Tech.ChEMBL_1792714 (CHEMBL4264633)
Kd 20±n/a nM
Citation Yang, SMUrban, DJYoshioka, MStrovel, JWFletcher, SWang, AQXu, XShah, PHu, XHall, MDJadhav, AMaloney, DJ Discovery and lead identification of quinazoline-based BRD4 inhibitors. Bioorg Med Chem Lett28:3483-3488 (2018) 
 
Bromodomain-containing protein 3
Name:Bromodomain-containing protein 3
Type:Protein
Mol. Mass.:79571.81
Organism:Homo sapiens (Human)
Description:Q15059
Residue:726
BDBM50466254
NameBDBM50466254
Synonyms:CHEMBL4288569
TypeSmall organic molecule
Emp. Form.C29H34ClN7O
Mol. Mass.532.08
SMILESCN(C)CCN1CCN(CC1)c1nc(NCc2cccc(Cl)c2)c2cc(ccc2n1)-c1ccc(=O)n(C)c1