Reaction Details
TargetDNA polymerase alpha catalytic subunit
LigandBDBM50025592
Substrate/Competitorn/a
Meas. Tech.ChEBML_50805
Ki 1000±n/a nM
Citation Wright, GEDudycz, LWKazimierczuk, ZBrown, NCKhan, NN Synthesis, cell growth inhibition, and antitumor screening of 2-(p-n-butylanilino)purines and their nucleoside analogues. J Med Chem30:109-16 (1987) DNA polymerase alpha catalytic subunit
Name:DNA polymerase alpha catalytic subunit
Type:PROTEIN
Mol. Mass.:165895.25
Organism:Homo sapiens (Human)
Description:ChEMBL_1365493
Residue:1462
BDBM50025592
NameBDBM50025592
Synonyms:(4-Butyl-phenyl)-(6-methylsulfanyl-9H-purin-2-yl)-amine | CHEMBL278903
TypeSmall organic molecule
Emp. Form.C16H19N5S
Mol. Mass.313.421
SMILESCCCCc1ccc(Nc2nc(SC)c3[nH]cnc3n2)cc1