Reaction Details
TargetVasopressin V1b receptor
LigandBDBM50466872
Substrate/Competitorn/a
Meas. Tech.ChEMBL_1794570 (CHEMBL4266687)
Ki 1.3±n/a nM
Citation Geneste, HBhowmik, Svan Gaalen, MMHornberger, WHutchins, CWNetz, AOost, TUnger, L Novel, potent, selective and brain penetrant vasopressin 1b receptor antagonists. Bioorg Med Chem Lett28:3260-3264 (2018) 
 
Vasopressin V1b receptor
Name:Vasopressin V1b receptor
Type:Enzyme
Mol. Mass.:46985.01
Organism:Homo sapiens (Human)
Description:P47901
Residue:424
BDBM50466872
NameBDBM50466872
Synonyms:CHEMBL4281098
TypeSmall organic molecule
Emp. Form.C32H30ClN7O5S
Mol. Mass.660.142
SMILESCCOc1nc(Cl)ccc1C1(N2CCN(CC2)c2ccnc(C)c2)C(=O)N(c2ccc(cc12)C#N)S(=O)(=O)c1ccc(OC)cn1