Reaction Details
TargetVasopressin V1b receptor
LigandBDBM50466882
Substrate/Competitorn/a
Meas. Tech.ChEMBL_1794570 (CHEMBL4266687)
Ki 1.1±n/a nM
Citation Geneste, HBhowmik, Svan Gaalen, MMHornberger, WHutchins, CWNetz, AOost, TUnger, L Novel, potent, selective and brain penetrant vasopressin 1b receptor antagonists. Bioorg Med Chem Lett28:3260-3264 (2018) 
 
Vasopressin V1b receptor
Name:Vasopressin V1b receptor
Type:Enzyme
Mol. Mass.:46985.01
Organism:Homo sapiens (Human)
Description:P47901
Residue:424
BDBM50466882
NameBDBM50466882
Synonyms:CHEMBL4280894
TypeSmall organic molecule
Emp. Form.C31H28ClN7O5S
Mol. Mass.646.116
SMILESCCOc1nc(Cl)ccc1C1(N2CCN(CC2)c2ccncc2)C(=O)N(c2ccc(cc12)C#N)S(=O)(=O)c1ccc(OC)cn1